Reaction Details
TargetLeucine-rich repeat serine/threonine-protein kinase 2
LigandBDBM129014
Substrate/Competitorn/a
Meas. Tech.LabChip Assay
Ki 2.5±n/a nM
Citation Baker-Glenn, CBurdick, DJChambers, MChan, BKChen, HEstrada, AGunzner-Tate, JShore, DSweeney, ZKWang, SZhao, G Aminopyrimidine derivatives as LRRK2 modulators US Patent US8802674 Publication Date 8/12/2014
 
Leucine-rich repeat serine/threonine-protein kinase 2
Name:Leucine-rich repeat serine/threonine-protein kinase 2
Type:Protein
Mol. Mass.:286113.20
Organism:Homo sapiens (Human)
Description:Q5S007
Residue:2527
BDBM129014
NameBDBM129014
Synonyms:US8802674, 15
TypeSmall organic molecule
Emp. Form.C18H22ClN5O2
Mol. Mass.375.853
SMILESCNc1nc(Nc2ccc(cc2OC)C(=O)N2CCCCC2)ncc1Cl