Reaction Details
TargetLeucine-rich repeat serine/threonine-protein kinase 2
LigandBDBM129042
Substrate/Competitorn/a
Meas. Tech.LabChip Assay
Ki 2.4±n/a nM
Citation Baker-Glenn, CBurdick, DJChambers, MChan, BKChen, HEstrada, AGunzner-Tate, JShore, DSweeney, ZKWang, SZhao, G Aminopyrimidine derivatives as LRRK2 modulators US Patent US8802674 Publication Date 8/12/2014
 
Leucine-rich repeat serine/threonine-protein kinase 2
Name:Leucine-rich repeat serine/threonine-protein kinase 2
Type:Protein
Mol. Mass.:286113.20
Organism:Homo sapiens (Human)
Description:Q5S007
Residue:2527
BDBM129042
NameBDBM129042
Synonyms:US8802674, 76
TypeSmall organic molecule
Emp. Form.C19H24BrN5O3
Mol. Mass.450.33
SMILESCNc1nc(Nc2ccc(cc2OC)C(=O)N2CCC(CC2)OC)ncc1Br