Reaction Details
TargetLeucine-rich repeat serine/threonine-protein kinase 2
LigandBDBM129049
Substrate/Competitorn/a
Meas. Tech.LabChip Assay
Ki 2.5±n/a nM
Citation Baker-Glenn, CBurdick, DJChambers, MChan, BKChen, HEstrada, AGunzner-Tate, JShore, DSweeney, ZKWang, SZhao, G Aminopyrimidine derivatives as LRRK2 modulators US Patent US8802674 Publication Date 8/12/2014
 
Leucine-rich repeat serine/threonine-protein kinase 2
Name:Leucine-rich repeat serine/threonine-protein kinase 2
Type:Protein
Mol. Mass.:286113.20
Organism:Homo sapiens (Human)
Description:Q5S007
Residue:2527
BDBM129049
NameBDBM129049
Synonyms:US8802674, 83
TypeSmall organic molecule
Emp. Form.C19H24BrN5O3
Mol. Mass.450.33
SMILESCCN1CCN(CC1)C(=O)c1ccc(Nc2ncc(Br)c(OC)n2)c(OC)c1