Reaction Details
TargetLeucine-rich repeat serine/threonine-protein kinase 2
LigandBDBM50398668
Substrate/Competitorn/a
Meas. Tech.LabChip Assay
Ki 2±n/a nM
Citation Baker-Glenn, CBurdick, DJChambers, MChan, BKChen, HEstrada, AGunzner-Tate, JShore, DSweeney, ZKWang, SZhao, G Aminopyrimidine derivatives as LRRK2 modulators US Patent US8802674 Publication Date 8/12/2014
 
Leucine-rich repeat serine/threonine-protein kinase 2
Name:Leucine-rich repeat serine/threonine-protein kinase 2
Type:Protein
Mol. Mass.:286113.20
Organism:Homo sapiens (Human)
Description:Q5S007
Residue:2527
BDBM50398668
NameBDBM50398668
Synonyms:CHEMBL2178134 | US8802674, 256
TypeSmall organic molecule
Emp. Form.C19H21F4N5O3
Mol. Mass.443.3954
SMILESCCNc1nc(Nc2cc(F)c(cc2OC)C(=O)N2CCOCC2)ncc1C(F)(F)F