Reaction Details
TargetLeucine-rich repeat serine/threonine-protein kinase 2
LigandBDBM129152
Substrate/Competitorn/a
Meas. Tech.LabChip Assay
Ki 2±n/a nM
Citation Baker-Glenn, CBurdick, DJChambers, MChan, BKChen, HEstrada, AGunzner-Tate, JShore, DSweeney, ZKWang, SZhao, G Aminopyrimidine derivatives as LRRK2 modulators US Patent US8802674 Publication Date 8/12/2014
 
Leucine-rich repeat serine/threonine-protein kinase 2
Name:Leucine-rich repeat serine/threonine-protein kinase 2
Type:Protein
Mol. Mass.:286113.20
Organism:Homo sapiens (Human)
Description:Q5S007
Residue:2527
BDBM129152
NameBDBM129152
Synonyms:US8802674, 257
TypeSmall organic molecule
Emp. Form.C19H22F3N5O3
Mol. Mass.425.4049
SMILESCCNc1nc(Nc2ccc(cc2OC)C(=O)N2CCOCC2)ncc1C(F)(F)F