Reaction Details
TargetLeucine-rich repeat serine/threonine-protein kinase 2
LigandBDBM129173
Substrate/Competitorn/a
Meas. Tech.LabChip Assay
Ki 0.8±n/a nM
Citation Baker-Glenn, CBurdick, DJChambers, MChan, BKChen, HEstrada, AGunzner-Tate, JShore, DSweeney, ZKWang, SZhao, G Aminopyrimidine derivatives as LRRK2 modulators US Patent US8802674 Publication Date 8/12/2014
 
Leucine-rich repeat serine/threonine-protein kinase 2
Name:Leucine-rich repeat serine/threonine-protein kinase 2
Type:Protein
Mol. Mass.:286113.20
Organism:Homo sapiens (Human)
Description:Q5S007
Residue:2527
BDBM129173
NameBDBM129173
Synonyms:US8802674, 276
TypeSmall organic molecule
Emp. Form.C21H27F3N6O2
Mol. Mass.452.4733
SMILESCNc1nc(Nc2ccc(cc2OC)C(=O)N2CCC(CC2)N(C)C)ncc1C(F)(F)F