Reaction Details
TargetLeucine-rich repeat serine/threonine-protein kinase 2
LigandBDBM129184
Substrate/Competitorn/a
Meas. Tech.LabChip Assay
Ki 2.6±n/a nM
Citation Baker-Glenn, CBurdick, DJChambers, MChan, BKChen, HEstrada, AGunzner-Tate, JShore, DSweeney, ZKWang, SZhao, G Aminopyrimidine derivatives as LRRK2 modulators US Patent US8802674 Publication Date 8/12/2014
 
Leucine-rich repeat serine/threonine-protein kinase 2
Name:Leucine-rich repeat serine/threonine-protein kinase 2
Type:Protein
Mol. Mass.:286113.20
Organism:Homo sapiens (Human)
Description:Q5S007
Residue:2527
BDBM129184
NameBDBM129184
Synonyms:US8802674, 288
TypeSmall organic molecule
Emp. Form.C17H19BrClN5O3
Mol. Mass.456.721
SMILESCNc1nc(Nc2cc(OC)c(cc2Cl)C(=O)N2CCOCC2)ncc1Br