Reaction Details
TargetLeucine-rich repeat serine/threonine-protein kinase 2
LigandBDBM129202
Substrate/Competitorn/a
Meas. Tech.LabChip Assay
Ki 2.1±n/a nM
Citation Baker-Glenn, CBurdick, DJChambers, MChan, BKChen, HEstrada, AGunzner-Tate, JShore, DSweeney, ZKWang, SZhao, G Aminopyrimidine derivatives as LRRK2 modulators US Patent US8802674 Publication Date 8/12/2014
 
Leucine-rich repeat serine/threonine-protein kinase 2
Name:Leucine-rich repeat serine/threonine-protein kinase 2
Type:Protein
Mol. Mass.:286113.20
Organism:Homo sapiens (Human)
Description:Q5S007
Residue:2527
BDBM129202
NameBDBM129202
Synonyms:US8802674, 309
TypeSmall organic molecule
Emp. Form.C20H23F4N5O3
Mol. Mass.457.4219
SMILESCCNc1nc(Nc2cc(F)c(cc2OCC)C(=O)N2CCOCC2)ncc1C(F)(F)F