Reaction Details
TargetLeucine-rich repeat serine/threonine-protein kinase 2
LigandBDBM50396147
Substrate/Competitorn/a
Meas. Tech.LabChip Assay
Ki 2.4±n/a nM
Citation Baker-Glenn, CBurdick, DJChambers, MChan, BKChen, HEstrada, AGunzner-Tate, JShore, DSweeney, ZKWang, SZhao, G Aminopyrimidine derivatives as LRRK2 modulators US Patent US8802674 Publication Date 8/12/2014
 
Leucine-rich repeat serine/threonine-protein kinase 2
Name:Leucine-rich repeat serine/threonine-protein kinase 2
Type:Protein
Mol. Mass.:286113.20
Organism:Homo sapiens (Human)
Description:Q5S007
Residue:2527
BDBM50396147
NameBDBM50396147
Synonyms:CHEMBL2171746 | US8802674, 314
TypeSmall organic molecule
Emp. Form.C18H20N6O3
Mol. Mass.368.3898
SMILESCNc1nc(Nc2ccc(cc2OC)C(=O)N2CCOCC2)ncc1C#N