Reaction Details
TargetEpoxide hydrolase 1
LigandBDBM50383476
Substrate/Competitorn/a
Meas. Tech.Activity Assay
IC50 100±n/a nM
Citation Hammock, BDZheng, JMorisseau, CMotoba, KMoghaddam, MFBorhan, BGrant, DFGreene, JSisemore, MFSanborn, J Inhibitors of epoxide hydrolases for the treatment of inflammation US Patent US8815951 Publication Date 8/26/2014
 
Epoxide hydrolase 1
Name:Epoxide hydrolase 1
Type:Protein
Mol. Mass.:52954.28
Organism:Homo sapiens (Human)
Description:P07099
Residue:455
BDBM50383476
NameBDBM50383476
Synonyms:CHEMBL2031923 | US8815951, 438
TypeSmall organic molecule
Emp. Form.C20H28N2O
Mol. Mass.312.4491
SMILESO=C(NCCCc1ccccc1)NC12CC3CC(CC(C3)C1)C2