Reaction Details
TargetCyclin-dependent kinase 1
LigandBDBM129353
Substrate/Competitorn/a
Meas. Tech.Kinase Assay
pH8±n/a
Temperature295.15±n/a K
IC50 3±n/a nM
Commentsextracted
Citation Lücking, USiemeister, GLienau, PJautelat, RSchulze, J Sulfone-substituted anilinopyrimidine derivatives as CDK inhibitors, the production thereof, and use as a medicine US Patent US8802686 Publication Date 8/12/2014
 
Cyclin-dependent kinase 1
Name:Cyclin-dependent kinase 1
Type:Enzyme Subunit
Mol. Mass.:34101.08
Organism:Homo sapiens (Human)
Description:P06493
Residue:297
BDBM129353
NameBDBM129353
Synonyms:US8802686, 11
TypeSmall organic molecule
Emp. Form.C17H20F3N3O5S
Mol. Mass.435.418
SMILESC[C@@H](O)[C@@H](C)Oc1nc(Nc2ccc(cc2)S(=O)(=O)CCO)ncc1C(F)(F)F