Reaction Details
TargetFibroblast growth factor receptor 3
LigandBDBM102531
Substrate/Competitorn/a
Meas. Tech.LanthaScreen TR-FRET Assay
Temperature298.15±n/a K
IC50 20±n/a nM
Commentsextracted
Citation Furet, PGraus Porta, DGuagnano, V Quinoline carboxamide derivatives as protein tyrosine kinase inhibitors US Patent US8815901 Publication Date 8/26/2014
 
Fibroblast growth factor receptor 3
Name:Fibroblast growth factor receptor 3
Type:Protein
Mol. Mass.:87699.57
Organism:Homo sapiens (Human)
Description:P22607
Residue:806
BDBM102531
NameBDBM102531
Synonyms:US8536175, 106
TypeSmall organic molecule
Emp. Form.C29H30Cl2N6O4
Mol. Mass.597.492
SMILESCOc1cc(OC)c(Cl)c(c1Cl)-c1ccc(C(=O)Nc2ccc(CN3CCN(CCO)CC3)cn2)c2nccnc12