Reaction Details
TargetFibroblast growth factor receptor 3
LigandBDBM130078
Substrate/Competitorn/a
Meas. Tech.LanthaScreen TR-FRET Assay
Temperature298.15±n/a K
IC50 11±n/a nM
Commentsextracted
Citation Furet, PGraus Porta, DGuagnano, V Quinoline carboxamide derivatives as protein tyrosine kinase inhibitors US Patent US8815901 Publication Date 8/26/2014
 
Fibroblast growth factor receptor 3
Name:Fibroblast growth factor receptor 3
Type:Protein
Mol. Mass.:87699.57
Organism:Homo sapiens (Human)
Description:P22607
Residue:806
BDBM130078
NameBDBM130078
Synonyms:US8815901, 135
TypeSmall organic molecule
Emp. Form.C25H24F2N6O4
Mol. Mass.510.4927
SMILESCOc1cc(OC)c(F)c(c1F)-c1ccc(C(=O)Nc2ncc(CN3CCOCC3)[nH]2)c2nccnc12