Reaction Details
TargetFibroblast growth factor receptor 3
LigandBDBM130079
Substrate/Competitorn/a
Meas. Tech.LanthaScreen TR-FRET Assay
Temperature298.15±n/a K
IC50 11±n/a nM
Commentsextracted
Citation Furet, PGraus Porta, DGuagnano, V Quinoline carboxamide derivatives as protein tyrosine kinase inhibitors US Patent US8815901 Publication Date 8/26/2014
 
Fibroblast growth factor receptor 3
Name:Fibroblast growth factor receptor 3
Type:Protein
Mol. Mass.:87699.57
Organism:Homo sapiens (Human)
Description:P22607
Residue:806
BDBM130079
NameBDBM130079
Synonyms:US8815901, 153
TypeSmall organic molecule
Emp. Form.C23H22ClFN6O3
Mol. Mass.484.911
SMILESCOc1cc(OC)c(Cl)c(c1F)-c1ccc(C(=O)Nc2ncc(CN(C)C)[nH]2)c2nccnc12