Reaction Details
TargetMembrane metallo-endopeptidase-like 1
LigandBDBM130365
Substrate/Competitorn/a
Meas. Tech.Inhibition Assay
pH7.4±n/a
Temperature298.15±n/a K
IC50 0.2±n/a nM
Commentsextracted
Citation Iwaki, YKarki, RGKsander, GM Substituted aminopropionic derivatives as neprilysin inhibitors US Patent US8822534 Publication Date 9/2/2014
 
Membrane metallo-endopeptidase-like 1
Name:Membrane metallo-endopeptidase-like 1
Type:Enzyme
Mol. Mass.:89358.76
Organism:Homo sapiens (Human)
Description:Q495T6
Residue:779
BDBM130365
NameBDBM130365
Synonyms:US8822534, Example 11-1 US8993631, 9-1
TypeSmall organic molecule
Emp. Form.C20H20ClNO5
Mol. Mass.389.83
SMILESOC(=O)CCC(=O)N[C@@H](CC(O)=O)Cc1ccc(cc1)-c1cccc(Cl)c1