Reaction Details
TargetD(1A) dopamine receptor
LigandBDBM130462
Substrate/Competitorn/a
Meas. Tech.Receptor Binding Assay
Ki 1.83±n/a nM
Citation Davoren, JEDounay, ABEfremov, IVGray, DLMente, SRO'Neil, SVRogers, BNSubramanyam, CZhang, L Heteroaromatic compounds and their use as dopamine D1 ligands US Patent US8822494 Publication Date 9/2/2014
 
D(1A) dopamine receptor
Name:D(1A) dopamine receptor
Type:Enzyme
Mol. Mass.:49303.43
Organism:Homo sapiens (Human)
Description:P21728
Residue:446
BDBM130462
NameBDBM130462
Synonyms:US8822494, 8
TypeSmall organic molecule
Emp. Form.C19H17N5O3
Mol. Mass.363.37
SMILESCc1cc(Oc2nccc3n[nH]cc23)ccc1-c1c(C)c(=O)[nH]c(=O)n1C