Reaction Details
TargetProto-oncogene tyrosine-protein kinase ROS
LigandBDBM130911
Substrate/Competitorn/a
Meas. Tech.In Vitro Kinase Activity Assay
pH7.5±n/a
IC50 0.436±n/a nM
Commentsextracted
Citation Gregor, VE Tyrosine kinase inhibitors US Patent US8822500 Publication Date 9/2/2014
 
Proto-oncogene tyrosine-protein kinase ROS
Name:Proto-oncogene tyrosine-protein kinase ROS
Type:Enzyme
Mol. Mass.:263897.39
Organism:Homo sapiens (Human)
Description:P08922
Residue:2347
BDBM130911
NameBDBM130911
Synonyms:US8822500, [2]
TypeSmall organic molecule
Emp. Form.C27H24F4N6O3
Mol. Mass.556.5115
SMILESC[C@@H](Cc1c(F)c(F)cc(F)c1F)Nc1cc[nH]c(=O)c1-c1nc2cc3C(=O)N(CCN(C)C)C(=O)c3cc2[nH]1