Reaction Details
TargetcGMP-specific 3',5'-cyclic phosphodiesterase
LigandBDBM131009
Substrate/Competitorn/a
Meas. Tech.Inhibition Assay
Temperature303.15±n/a K
IC50>10000±n/a nM
Commentsextracted
Citation Okada, MSato, SKawade, KGotanda, KShinbo, ANakano, YKobayashi, H Substituted imidazo[1,5-A]quinoxalines as phosphodiesterase 9 inhibitors US Patent US8829000 Publication Date 9/9/2014
 
cGMP-specific 3',5'-cyclic phosphodiesterase
Name:cGMP-specific 3',5'-cyclic phosphodiesterase
Type:Protein
Mol. Mass.:99975.83
Organism:Homo sapiens (Human)
Description:O76074
Residue:875
BDBM131009
NameBDBM131009
Synonyms:US8829000, 82
TypeSmall organic molecule
Emp. Form.C21H26N4O3
Mol. Mass.382.4561
SMILESCCOc1cc2c(cc1C(=O)N(C)C)[nH]c(=O)c1cnc(C3CCCCC3)n21