Reaction Details
TargetcGMP-specific 3',5'-cyclic phosphodiesterase
LigandBDBM131016
Substrate/Competitorn/a
Meas. Tech.Inhibition Assay
Temperature303.15±n/a K
IC50 1337±n/a nM
Commentsextracted
Citation Okada, MSato, SKawade, KGotanda, KShinbo, ANakano, YKobayashi, H Substituted imidazo[1,5-A]quinoxalines as phosphodiesterase 9 inhibitors US Patent US8829000 Publication Date 9/9/2014
 
cGMP-specific 3',5'-cyclic phosphodiesterase
Name:cGMP-specific 3',5'-cyclic phosphodiesterase
Type:Protein
Mol. Mass.:99975.83
Organism:Homo sapiens (Human)
Description:O76074
Residue:875
BDBM131016
NameBDBM131016
Synonyms:US8829000, Referential Example 1
TypeSmall organic molecule
Emp. Form.C15H15ClN4O
Mol. Mass.302.759
SMILESCC(C)c1n[nH]c2c1nc(Cc1cccc(Cl)c1)[nH]c2=O