Reaction Details
TargetDihydrofolate reductase
LigandBDBM50351180
Substrate/Competitorn/a
Meas. Tech.Inhibition Assay
Ki 0.48±n/a nM
Citation Chen, ZCreighton, CJCunningham, MFinn, JHilgers, MJung, MKohnen, LALam, TLi, XStidham, MTari, LTrzoss, MZhang, J Dihydrofolate reductase inhibitors US Patent US8835445 Publication Date 9/16/2014
 
Dihydrofolate reductase
Name:Dihydrofolate reductase
Type:Enzyme
Mol. Mass.:18249.71
Organism:Staphylococcus aureus
Description:n/a
Residue:159
BDBM50351180
NameBDBM50351180
Synonyms:CHEMBL1818120 | US8835445, 7
TypeSmall organic molecule
Emp. Form.C17H16N4O
Mol. Mass.292.3351
SMILESCC(=O)c1cccc(c1)-c1cc2nc(N)nc(N)c2cc1C