Reaction Details
TargetDihydrofolate reductase
LigandBDBM131839
Substrate/Competitorn/a
Meas. Tech.Inhibition Assay
Ki 0.51±n/a nM
Citation Chen, ZCreighton, CJCunningham, MFinn, JHilgers, MJung, MKohnen, LALam, TLi, XStidham, MTari, LTrzoss, MZhang, J Dihydrofolate reductase inhibitors US Patent US8835445 Publication Date 9/16/2014
 
Dihydrofolate reductase
Name:Dihydrofolate reductase
Type:Enzyme
Mol. Mass.:18249.71
Organism:Staphylococcus aureus
Description:n/a
Residue:159
BDBM131839
NameBDBM131839
Synonyms:US8835445, 10
TypeSmall organic molecule
Emp. Form.C20H20N6O2
Mol. Mass.376.4118
SMILESNc1nc(N)c2cc(Cn3ccnc3)c(cc2n1)-c1ccc(CO)c(CO)c1