Reaction Details
TargetDihydrofolate reductase
LigandBDBM50448756
Substrate/Competitorn/a
Meas. Tech.Inhibition Assay
Ki 0.012±n/a nM
Citation Chen, ZCreighton, CJCunningham, MFinn, JHilgers, MJung, MKohnen, LALam, TLi, XStidham, MTari, LTrzoss, MZhang, J Dihydrofolate reductase inhibitors US Patent US8835445 Publication Date 9/16/2014
 
Dihydrofolate reductase
Name:Dihydrofolate reductase
Type:Enzyme
Mol. Mass.:18249.71
Organism:Staphylococcus aureus
Description:n/a
Residue:159
BDBM50448756
NameBDBM50448756
Synonyms:CHEMBL3128026 | US8835445, 21
TypeSmall organic molecule
Emp. Form.C21H18N6S
Mol. Mass.386.473
SMILESCc1cc2nc(-c3ccsc3)n(-c3ccc4c(N)nc(N)nc4c3)c2cc1C