Reaction Details
TargetDihydrofolate reductase
LigandBDBM50448761
Substrate/Competitorn/a
Meas. Tech.Inhibition Assay
Ki 0.002±n/a nM
Citation Chen, ZCreighton, CJCunningham, MFinn, JHilgers, MJung, MKohnen, LALam, TLi, XStidham, MTari, LTrzoss, MZhang, J Dihydrofolate reductase inhibitors US Patent US8835445 Publication Date 9/16/2014
 
Dihydrofolate reductase
Name:Dihydrofolate reductase
Type:Enzyme
Mol. Mass.:18249.71
Organism:Staphylococcus aureus
Description:n/a
Residue:159
BDBM50448761
NameBDBM50448761
Synonyms:CHEMBL3128021 | US8835445, 22
TypeSmall organic molecule
Emp. Form.C20H17N7S
Mol. Mass.387.461
SMILESCc1cc2nc(-c3nccs3)n(-c3ccc4c(N)nc(N)nc4c3)c2cc1C