Reaction Details
TargetDihydrofolate reductase
LigandBDBM131852
Substrate/Competitorn/a
Meas. Tech.Inhibition Assay
Ki 0.16±n/a nM
Citation Chen, ZCreighton, CJCunningham, MFinn, JHilgers, MJung, MKohnen, LALam, TLi, XStidham, MTari, LTrzoss, MZhang, J Dihydrofolate reductase inhibitors US Patent US8835445 Publication Date 9/16/2014
 
Dihydrofolate reductase
Name:Dihydrofolate reductase
Type:Enzyme
Mol. Mass.:18249.71
Organism:Staphylococcus aureus
Description:n/a
Residue:159
BDBM131852
NameBDBM131852
Synonyms:US8835445, 35
TypeSmall organic molecule
Emp. Form.C20H17N7O2S
Mol. Mass.419.46
SMILESCOc1cc2n(c(nc2cc1CO)-c1nccs1)-c1ccc2c(N)nc(N)nc2c1