Reaction Details
TargetAcetylcholinesterase
LigandBDBM132074
Substrate/Competitorn/a
Meas. Tech.Inhibition Assay
IC50 7.7±n/a nM
Citation Zawadzka, ACzarnocki, ZLozinska, IMoleda, ZPanasiewicz, M Hybrid cholinesterase inhibitors US Patent US8841453 Publication Date 9/23/2014
 
Acetylcholinesterase
Name:Acetylcholinesterase
Type:Enzyme
Mol. Mass.:67792.70
Organism:Homo sapiens (Human)
Description:P22303
Residue:614
BDBM132074
NameBDBM132074
Synonyms:US8841453, 4
TypeSmall organic molecule
Emp. Form.C33H40ClN5O3
Mol. Mass.590.155
SMILESCC(=O)NCCc1c[nH]c2ccc(OC(=O)NCCCCCCCNc3c4CCCCc4nc4cc(Cl)ccc34)cc12