Reaction Details
TargetAcetylcholinesterase
LigandBDBM132086
Substrate/Competitorn/a
Meas. Tech.Inhibition Assay
IC50 8.1±n/a nM
Citation Zawadzka, ACzarnocki, ZLozinska, IMoleda, ZPanasiewicz, M Hybrid cholinesterase inhibitors US Patent US8841453 Publication Date 9/23/2014
 
Acetylcholinesterase
Name:Acetylcholinesterase
Type:Enzyme
Mol. Mass.:67792.70
Organism:Homo sapiens (Human)
Description:P22303
Residue:614
BDBM132086
NameBDBM132086
Synonyms:US8841453, 18
TypeSmall organic molecule
Emp. Form.C36H46ClN5O3
Mol. Mass.632.235
SMILESCC(=O)NCCc1c[nH]c2ccc(OC(=O)NCCCCCCCCCCNc3c4CCCCc4nc4cc(Cl)ccc34)cc12