Reaction Details
TargetCholinesterase
LigandBDBM132076
Substrate/Competitorn/a
Meas. Tech.Inhibition Assay
IC50 3.15±n/a nM
Citation Zawadzka, ACzarnocki, ZLozinska, IMoleda, ZPanasiewicz, M Hybrid cholinesterase inhibitors US Patent US8841453 Publication Date 9/23/2014
 
Cholinesterase
Name:Cholinesterase
Type:Homotetramer
Mol. Mass.:68422.27
Organism:Homo sapiens (Human)
Description:P06276
Residue:602
BDBM132076
NameBDBM132076
Synonyms:US8841453, 7
TypeSmall organic molecule
Emp. Form.C36H43N5O6
Mol. Mass.641.7565
SMILESCC(=O)O[C@@]12CCN([C@@H]1N(C(C)=O)c1ccc(OC(=O)NCCCCCCNc3c4CCCCc4nc4ccccc34)cc21)C(C)=O