Reaction Details
TargetCholinesterase
LigandBDBM132080
Substrate/Competitorn/a
Meas. Tech.Inhibition Assay
IC50 0.25±n/a nM
Citation Zawadzka, ACzarnocki, ZLozinska, IMoleda, ZPanasiewicz, M Hybrid cholinesterase inhibitors US Patent US8841453 Publication Date 9/23/2014
 
Cholinesterase
Name:Cholinesterase
Type:Homotetramer
Mol. Mass.:68422.27
Organism:Homo sapiens (Human)
Description:P06276
Residue:602
BDBM132080
NameBDBM132080
Synonyms:US8841453, 11
TypeSmall organic molecule
Emp. Form.C34H43N5O3
Mol. Mass.569.7369
SMILESCC(=O)NCCc1c[nH]c2ccc(OC(=O)NCCCCCCCCNc3c4CCCCc4nc4ccccc34)cc12