Reaction Details
TargetCholinesterase
LigandBDBM132084
Substrate/Competitorn/a
Meas. Tech.Inhibition Assay
IC50 0.24±n/a nM
Citation Zawadzka, ACzarnocki, ZLozinska, IMoleda, ZPanasiewicz, M Hybrid cholinesterase inhibitors US Patent US8841453 Publication Date 9/23/2014
 
Cholinesterase
Name:Cholinesterase
Type:Homotetramer
Mol. Mass.:68422.27
Organism:Homo sapiens (Human)
Description:P06276
Residue:602
BDBM132084
NameBDBM132084
Synonyms:US8841453, 15
TypeSmall organic molecule
Emp. Form.C38H51N5O3
Mol. Mass.625.8432
SMILESCC(=O)NCCc1c[nH]c2ccc(OC(=O)NCCCCCCCCCCCCNc3c4CCCCc4nc4ccccc34)cc12