Reaction Details
TargetCholinesterase
LigandBDBM132088
Substrate/Competitorn/a
Meas. Tech.Inhibition Assay
IC50 0.78±n/a nM
Citation Zawadzka, ACzarnocki, ZLozinska, IMoleda, ZPanasiewicz, M Hybrid cholinesterase inhibitors US Patent US8841453 Publication Date 9/23/2014
 
Cholinesterase
Name:Cholinesterase
Type:Homotetramer
Mol. Mass.:68422.27
Organism:Homo sapiens (Human)
Description:P06276
Residue:602
BDBM132088
NameBDBM132088
Synonyms:US8841453, 17
TypeSmall organic molecule
Emp. Form.C38H50ClN5O3
Mol. Mass.660.288
SMILESCC(=O)NCCc1c[nH]c2ccc(OC(=O)NCCCCCCCCCCCCNc3c4CCCCc4nc4ccc(Cl)cc34)cc12