Reaction Details
TargetCyclin-dependent kinase 4
LigandBDBM132264
Substrate/Competitorn/a
Meas. Tech.In Vitro Assay
pH7.4±n/a
Temperature310.15±n/a K
IC50 1.5±n/a nM
Citation Connors, RVKang, DEksterowicz, JFan, PFisher, BFu, JLi, KLi, ZMcGee, LRSharma, RWang, XMcMinn, DLMihalic, JTDeignan, J Fused pyridine, pyrimidine and triazine compounds as cell cycle inhibitors US Patent US8841312 Publication Date 9/23/2014
 
Cyclin-dependent kinase 4
Name:Cyclin-dependent kinase 4
Type:Enzyme Subunit
Mol. Mass.:33731.96
Organism:Homo sapiens (Human)
Description:P11802
Residue:303
BDBM132264
NameBDBM132264
Synonyms:US8841312, 6
TypeSmall organic molecule
Emp. Form.C22H25N9
Mol. Mass.415.4942
SMILESC1CCC(C1)n1c2cnccc2c2cnc(Nc3ccc(nn3)N3CCNCC3)nc12