Reaction Details
TargetCyclin-dependent kinase 4
LigandBDBM132696
Substrate/Competitorn/a
Meas. Tech.In Vitro Assay
pH7.4±n/a
Temperature310.15±n/a K
IC50 1.3±n/a nM
Citation Connors, RVKang, DEksterowicz, JFan, PFisher, BFu, JLi, KLi, ZMcGee, LRSharma, RWang, XMcMinn, DLMihalic, JTDeignan, J Fused pyridine, pyrimidine and triazine compounds as cell cycle inhibitors US Patent US8841312 Publication Date 9/23/2014
 
Cyclin-dependent kinase 4
Name:Cyclin-dependent kinase 4
Type:Enzyme Subunit
Mol. Mass.:33731.96
Organism:Homo sapiens (Human)
Description:P11802
Residue:303
BDBM132696
NameBDBM132696
Synonyms:US8841312, 446
TypeSmall organic molecule
Emp. Form.C26H33N9O2
Mol. Mass.503.5993
SMILESOC[C@H](O)CNC1CCN(CC1)c1ccc(Nc2ncc3c4ccncc4n(C4CCCC4)c3n2)nn1