Reaction Details
TargetCyclin-dependent kinase 4
LigandBDBM132708
Substrate/Competitorn/a
Meas. Tech.In Vitro Assay
pH7.4±n/a
Temperature310.15±n/a K
IC50 4.8±n/a nM
Citation Connors, RVKang, DEksterowicz, JFan, PFisher, BFu, JLi, KLi, ZMcGee, LRSharma, RWang, XMcMinn, DLMihalic, JTDeignan, J Fused pyridine, pyrimidine and triazine compounds as cell cycle inhibitors US Patent US8841312 Publication Date 9/23/2014
 
Cyclin-dependent kinase 4
Name:Cyclin-dependent kinase 4
Type:Enzyme Subunit
Mol. Mass.:33731.96
Organism:Homo sapiens (Human)
Description:P11802
Residue:303
BDBM132708
NameBDBM132708
Synonyms:US8841312, 458
TypeSmall organic molecule
Emp. Form.C26H32N8O
Mol. Mass.472.5853
SMILESOCCNC1CCN(CC1)c1ccc(Nc2ncc3c4ccncc4n(C4CCCC4)c3n2)nc1