Reaction Details
TargetCyclin-dependent kinase 6
LigandBDBM132275
Substrate/Competitorn/a
Meas. Tech.In Vitro Assay
pH7.4±n/a
Temperature310.15±n/a K
IC50 0.36±n/a nM
Citation Connors, RVKang, DEksterowicz, JFan, PFisher, BFu, JLi, KLi, ZMcGee, LRSharma, RWang, XMcMinn, DLMihalic, JTDeignan, J Fused pyridine, pyrimidine and triazine compounds as cell cycle inhibitors US Patent US8841312 Publication Date 9/23/2014
 
Cyclin-dependent kinase 6
Name:Cyclin-dependent kinase 6
Type:Enzyme Subunit
Mol. Mass.:36937.42
Organism:Homo sapiens (Human)
Description:Q00534
Residue:326
BDBM132275
NameBDBM132275
Synonyms:US8841312, 17
TypeSmall organic molecule
Emp. Form.C25H23N7
Mol. Mass.421.497
SMILESC1CN(CCN1)c1ccc(Nc2ncc3c(n2)n(-c2ccccc2)c2cnccc32)cc1