Reaction Details
TargetCyclin-dependent kinase 6
LigandBDBM132280
Substrate/Competitorn/a
Meas. Tech.In Vitro Assay
pH7.4±n/a
Temperature310.15±n/a K
IC50 2.5±n/a nM
Citation Connors, RVKang, DEksterowicz, JFan, PFisher, BFu, JLi, KLi, ZMcGee, LRSharma, RWang, XMcMinn, DLMihalic, JTDeignan, J Fused pyridine, pyrimidine and triazine compounds as cell cycle inhibitors US Patent US8841312 Publication Date 9/23/2014
 
Cyclin-dependent kinase 6
Name:Cyclin-dependent kinase 6
Type:Enzyme Subunit
Mol. Mass.:36937.42
Organism:Homo sapiens (Human)
Description:Q00534
Residue:326
BDBM132280
NameBDBM132280
Synonyms:US8841312, 22
TypeSmall organic molecule
Emp. Form.C25H29N7
Mol. Mass.427.5447
SMILESC1CCC(CC1)n1c2ccccc2c2cnc(Nc3ccc(cn3)N3CCNCC3)nc12