Reaction Details
TargetCyclin-dependent kinase 6
LigandBDBM132479
Substrate/Competitorn/a
Meas. Tech.In Vitro Assay
pH7.4±n/a
Temperature310.15±n/a K
IC50 3.9±n/a nM
Citation Connors, RVKang, DEksterowicz, JFan, PFisher, BFu, JLi, KLi, ZMcGee, LRSharma, RWang, XMcMinn, DLMihalic, JTDeignan, J Fused pyridine, pyrimidine and triazine compounds as cell cycle inhibitors US Patent US8841312 Publication Date 9/23/2014
 
Cyclin-dependent kinase 6
Name:Cyclin-dependent kinase 6
Type:Enzyme Subunit
Mol. Mass.:36937.42
Organism:Homo sapiens (Human)
Description:Q00534
Residue:326
BDBM132479
NameBDBM132479
Synonyms:US8841312, 228
TypeSmall organic molecule
Emp. Form.C23H25FN8O2S
Mol. Mass.496.56
SMILESFc1nccc2c3cnc(Nc4ccc(cn4)S(=O)(=O)N4CCNCC4)nc3n(C3CCCC3)c12