Reaction Details
TargetCyclin-dependent kinase 6
LigandBDBM132691
Substrate/Competitorn/a
Meas. Tech.In Vitro Assay
pH7.4±n/a
Temperature310.15±n/a K
IC50 3.8±n/a nM
Citation Connors, RVKang, DEksterowicz, JFan, PFisher, BFu, JLi, KLi, ZMcGee, LRSharma, RWang, XMcMinn, DLMihalic, JTDeignan, J Fused pyridine, pyrimidine and triazine compounds as cell cycle inhibitors US Patent US8841312 Publication Date 9/23/2014
 
Cyclin-dependent kinase 6
Name:Cyclin-dependent kinase 6
Type:Enzyme Subunit
Mol. Mass.:36937.42
Organism:Homo sapiens (Human)
Description:Q00534
Residue:326
BDBM132691
NameBDBM132691
Synonyms:US8841312, 441
TypeSmall organic molecule
Emp. Form.C26H33N9O
Mol. Mass.487.5999
SMILESC[C@@H](O)CNC1CCN(CC1)c1ccc(Nc2ncc3c4ccncc4n(C4CCCC4)c3n2)nn1