Reaction Details
TargetSodium/glucose cotransporter 1
LigandBDBM132940
Substrate/Competitorn/a
Meas. Tech.Inhibition Assay
Temperature310.15±n/a K
IC50 2.3±n/a nM
Commentsextracted
Citation Miura, TOgoshi, YUeyama, KMotoda, DIwayama, TSuzawa, KNagamori, HUeno, HTakahashi, ASugimoto, K Pyrazole compound and pharmaceutical use thereof US Patent US8846746 Publication Date 9/30/2014
 
Sodium/glucose cotransporter 1
Name:Sodium/glucose cotransporter 1
Type:Protein
Mol. Mass.:73503.78
Organism:Homo sapiens (Human)
Description:P13866
Residue:664
BDBM132940
NameBDBM132940
Synonyms:US8846746, 223
TypeSmall organic molecule
Emp. Form.C23H21F3N4O3
Mol. Mass.458.433
SMILESC[C@@H]1[C@H](CNC1=O)C(=O)Nc1cc(-c2cccc(OC(F)(F)F)c2)n(n1)-c1ccccc1C