Reaction Details
TargetSodium/glucose cotransporter 1
LigandBDBM132944
Substrate/Competitorn/a
Meas. Tech.Inhibition Assay
Temperature310.15±n/a K
IC50 2.1±n/a nM
Commentsextracted
Citation Miura, TOgoshi, YUeyama, KMotoda, DIwayama, TSuzawa, KNagamori, HUeno, HTakahashi, ASugimoto, K Pyrazole compound and pharmaceutical use thereof US Patent US8846746 Publication Date 9/30/2014
 
Sodium/glucose cotransporter 1
Name:Sodium/glucose cotransporter 1
Type:Protein
Mol. Mass.:73503.78
Organism:Homo sapiens (Human)
Description:P13866
Residue:664
BDBM132944
NameBDBM132944
Synonyms:US8846746, 227
TypeSmall organic molecule
Emp. Form.C24H23F3N4O3
Mol. Mass.472.4596
SMILESC[C@@H]1[C@H](CNC1=O)C(=O)Nc1cc(-c2cccc(OCC(F)(F)F)c2)n(n1)-c1ccccc1C