Reaction Details
TargetSodium/glucose cotransporter 1
LigandBDBM133116
Substrate/Competitorn/a
Meas. Tech.Inhibition Assay
Temperature310.15±n/a K
IC50 2.05±n/a nM
Commentsextracted
Citation Miura, TOgoshi, YUeyama, KMotoda, DIwayama, TSuzawa, KNagamori, HUeno, HTakahashi, ASugimoto, K Pyrazole compound and pharmaceutical use thereof US Patent US8846746 Publication Date 9/30/2014
 
Sodium/glucose cotransporter 1
Name:Sodium/glucose cotransporter 1
Type:Protein
Mol. Mass.:73503.78
Organism:Homo sapiens (Human)
Description:P13866
Residue:664
BDBM133116
NameBDBM133116
Synonyms:US8846746, 426
TypeSmall organic molecule
Emp. Form.C27H28F4N4O4
Mol. Mass.548.5292
SMILESCC(C)Oc1cc(ccc1F)-n1nc(NC(=O)[C@@H]2CNC(=O)C2)cc1-c1cccc(CO[C@H](C)C(F)(F)F)c1