Reaction Details
TargetSodium/glucose cotransporter 1
LigandBDBM133134
Substrate/Competitorn/a
Meas. Tech.Inhibition Assay
Temperature310.15±n/a K
IC50 1.7±n/a nM
Commentsextracted
Citation Miura, TOgoshi, YUeyama, KMotoda, DIwayama, TSuzawa, KNagamori, HUeno, HTakahashi, ASugimoto, K Pyrazole compound and pharmaceutical use thereof US Patent US8846746 Publication Date 9/30/2014
 
Sodium/glucose cotransporter 1
Name:Sodium/glucose cotransporter 1
Type:Protein
Mol. Mass.:73503.78
Organism:Homo sapiens (Human)
Description:P13866
Residue:664
BDBM133134
NameBDBM133134
Synonyms:US8846746, 452
TypeSmall organic molecule
Emp. Form.C26H27F3N4O4
Mol. Mass.516.5122
SMILESCCOc1cccc(c1)-n1nc(NC(=O)[C@@H]2CNC(=O)C2)cc1-c1cccc(CO[C@H](C)C(F)(F)F)c1