Reaction Details
TargetSodium/glucose cotransporter 1
LigandBDBM133208
Substrate/Competitorn/a
Meas. Tech.Inhibition Assay
Temperature310.15±n/a K
IC50 2.1±n/a nM
Commentsextracted
Citation Miura, TOgoshi, YUeyama, KMotoda, DIwayama, TSuzawa, KNagamori, HUeno, HTakahashi, ASugimoto, K Pyrazole compound and pharmaceutical use thereof US Patent US8846746 Publication Date 9/30/2014
 
Sodium/glucose cotransporter 1
Name:Sodium/glucose cotransporter 1
Type:Protein
Mol. Mass.:73503.78
Organism:Homo sapiens (Human)
Description:P13866
Residue:664
BDBM133208
NameBDBM133208
Synonyms:US8846746, 533
TypeSmall organic molecule
Emp. Form.C25H24F4N4O4
Mol. Mass.520.4761
SMILESCOc1cc(F)cc(c1)-n1nc(NC(=O)[C@@H]2CNC(=O)C2)cc1-c1cccc(CO[C@H](C)C(F)(F)F)c1