Reaction Details
TargetMitogen-activated protein kinase 1
LigandBDBM50358237
Substrate/Competitorn/a
Meas. Tech.Kinase Assay
pH7.4±n/a
IC50 23000±n/a nM
Commentsextracted
Citation Fischer, PMJarman, MMcDonald, ENutley, BRaynaud, FWilson, SWorkman, P Purine derivatives US Patent US8846696 Publication Date 9/30/2014
 
Mitogen-activated protein kinase 1
Name:Mitogen-activated protein kinase 1
Type:Ser/Thr Protein Kinase
Mol. Mass.:41392.76
Organism:Homo sapiens (Human)
Description:P28482
Residue:360
BDBM50358237
NameBDBM50358237
Synonyms:CHEMBL1922211 | US8846696, (3RS,4S)-4-{9-Isopropyl-6-[(pyridin-3-ylmethyl)-amino]-9H-purin-2-ylamino}-2,2-dimethyl-hexan-3-ol
TypeSmall organic molecule
Emp. Form.C22H33N7O
Mol. Mass.411.5437
SMILESCC[C@H](Nc1nc(NCc2cccnc2)c2ncn(C(C)C)c2n1)C(O)C(C)(C)C