Reaction Details
TargetMelanocortin receptor 4
LigandBDBM135630
Substrate/Competitorn/a
Meas. Tech.Competitive Inhibition Assay
pH7.5±n/a
Ki 0.7±n/a nM
Commentsextracted
Citation Shi, YSharma, SDDodd, JHYang, WChen, X Melanocortin receptor-specific peptides US Patent US8846601 Publication Date 9/30/2014
 
Melanocortin receptor 4
Name:Melanocortin receptor 4
Type:Enzyme
Mol. Mass.:36949.50
Organism:Homo sapiens (Human)
Description:P32245
Residue:332
BDBM135630
NameBDBM135630
Synonyms:US10179804, Example 15 US8846601, 15 | US9458201, 15
TypeSmall organic molecule
Emp. Form.C56H76N16O10
Mol. Mass.1133.3038
SMILESCC(=O)N[C@@H](CCCNC(N)=N)C(=O)N[C@H]1CC(=O)NCCCC[C@H](NC(=O)[C@H](Cc2c[nH]c3ccccc23)NC(=O)[C@H](CCCNC(N)=N)NC(=O)[C@@H](Cc2ccccc2)NC(=O)[C@@H]2C[C@H](CN2C1=O)OCc1ccccc1)C(N)=O