Reaction Details
TargetMelanocortin receptor 4
LigandBDBM135736
Substrate/Competitorn/a
Meas. Tech.Competitive Inhibition Assay
pH7.5±n/a
Ki 0.4±n/a nM
Commentsextracted
Citation Shi, YSharma, SDDodd, JHYang, WChen, X Melanocortin receptor-specific peptides US Patent US8846601 Publication Date 9/30/2014
 
Melanocortin receptor 4
Name:Melanocortin receptor 4
Type:Enzyme
Mol. Mass.:36949.50
Organism:Homo sapiens (Human)
Description:P32245
Residue:332
BDBM135736
NameBDBM135736
Synonyms:US10179804, Example 121 US8846601, 121 | US9458201, 121
TypeSmall organic molecule
Emp. Form.C48H71N17O9
Mol. Mass.1030.1858
SMILESCC(=O)N[C@@H](CCCNC(N)=N)C(=O)N[C@H]1CCCCNC(=O)C[C@H](NC(=O)[C@H](Cc2c[nH]c3ccccc23)NC(=O)[C@H](CCCNC(N)=N)NC(=O)[C@@H](Cc2ccccc2)NC(=O)[C@H](CCN)NC1=O)C(N)=O