Reaction Details
TargetMelanocortin receptor 4
LigandBDBM135754
Substrate/Competitorn/a
Meas. Tech.Competitive Inhibition Assay
pH7.5±n/a
Ki 1±n/a nM
Commentsextracted
Citation Shi, YSharma, SDDodd, JHYang, WChen, X Melanocortin receptor-specific peptides US Patent US8846601 Publication Date 9/30/2014
 
Melanocortin receptor 4
Name:Melanocortin receptor 4
Type:Enzyme
Mol. Mass.:36949.50
Organism:Homo sapiens (Human)
Description:P32245
Residue:332
BDBM135754
NameBDBM135754
Synonyms:US10179804, Example 139 US8846601, 139 | US9458201, 139
TypeSmall organic molecule
Emp. Form.C54H81N17O9
Mol. Mass.1112.3294
SMILESNCC[C@@H]1NC(=O)[C@H](CC(=O)NCCCC[C@H](NC(=O)[C@H](Cc2c[nH]c3ccccc23)NC(=O)[C@H](CCCNC(N)=N)NC(=O)[C@@H](Cc2ccccc2)NC1=O)C(N)=O)NC(=O)[C@H](CCCNC(N)=N)NC(=O)CC1CCCCC1