Reaction Details
Target5-hydroxytryptamine receptor 5A
LigandBDBM135794
Substrate/Competitorn/a
Meas. Tech.Binding Inhibition Assay
pH7.5±n/a
Temperature298.15±n/a K
Ki 4.6±n/a nM
Commentsextracted
Citation Kinoyama, IMiyazaki, TKoganemaru, YWashio, THamaguchi, W Nitrogenous-ring acylguanidine derivative US Patent US8853242 Publication Date 10/7/2014
 
5-hydroxytryptamine receptor 5A
Name:5-hydroxytryptamine receptor 5A
Type:Enzyme
Mol. Mass.:40266.25
Organism:Homo sapiens (Human)
Description:P47898
Residue:357
BDBM135794
NameBDBM135794
Synonyms:US8853242, 187
TypeSmall organic molecule
Emp. Form.C18H12F4N4O
Mol. Mass.376.3077
SMILESNC(N)=NC(=O)c1ccc2c(cnc(-c3c(F)cccc3F)c2c1)C(F)F