Reaction Details
Target5-hydroxytryptamine receptor 5A
LigandBDBM135796
Substrate/Competitorn/a
Meas. Tech.Binding Inhibition Assay
pH7.5±n/a
Temperature298.15±n/a K
Ki 2.3±n/a nM
Commentsextracted
Citation Kinoyama, IMiyazaki, TKoganemaru, YWashio, THamaguchi, W Nitrogenous-ring acylguanidine derivative US Patent US8853242 Publication Date 10/7/2014
 
5-hydroxytryptamine receptor 5A
Name:5-hydroxytryptamine receptor 5A
Type:Enzyme
Mol. Mass.:40266.25
Organism:Homo sapiens (Human)
Description:P47898
Residue:357
BDBM135796
NameBDBM135796
Synonyms:US8853242, 211
TypeSmall organic molecule
Emp. Form.C17H11ClF2N4O
Mol. Mass.360.745
SMILES[#7]\[#6](-[#7])=[#7]\[#6](=O)-c1ccc2c(Cl)cnc(-c3ccc(F)cc3F)c2c1