Reaction Details
TargetPlatelet-derived growth factor receptor alpha/beta
LigandBDBM4833
Substrate/Competitorn/a
Meas. Tech.Kinase Inhibition Assay
IC50 6310±n/a nM
Citation Connolly, CJHamby, JMSchroeder, MCBarvian, MLu, GHPanek, RLAmar, AShen, CKraker, AJFry, DWKlohs, WDDoherty, AM DISCOVERY AND STRUCTURE-ACTIVITY STUDIES OF A NOVEL SERIES OF PYRIDO[2,3-d]PYRIMIDINE TYROSINE KINASE INHIBITORS Bioorg Med Chem Lett7:2415-20 (1997)    Article
 
Platelet-derived growth factor receptor alpha/beta
Name:Platelet-derived growth factor receptor alpha/beta
Type:n/a
Mol. Mass.:n/a
Description:ASSAY_ID of EBI is 29498
Components:This complex has 2 components.
Component 1
Name:Platelet-derived growth factor receptor beta
Synonyms:Beta-type platelet-derived growth factor receptor CD140b antigen PDGF Receptor Substrate PDGFR PDGFR-1 PDGFRB PGFRB_HUMAN Platelet-derived growth factor receptor 1 Platelet-derived growth factor receptor beta (PDGFR-beta) Platelet-derived growth factor receptor beta (PDGFRbeta) | VHL/PDGFRB
Type:Enzyme
Mol. Mass.:123922.25
Organism:Homo sapiens (Human)
Description:P09619
Residue:1106
Component 2
Name:Platelet-derived growth factor receptor alpha
Synonyms:Alpha-type platelet-derived growth factor receptor PDGFRA PGFRA_HUMAN Platelet-derived growth factor receptor alpha (PDGFRA) RHEPDGFRA
Type:Protein
Mol. Mass.:122633.38
Organism:Homo sapiens (Human)
Description:P16234
Residue:1089
BDBM4833
NameBDBM4833
Synonyms:1-[2-amino-6-(4-methylphenyl)pyrido[2,3-d]pyrimidin-7-yl]-3-tert-butylurea | PD089828 analog 14
TypeSmall organic molecule
Emp. Form.C19H22N6O
Mol. Mass.350.4176
SMILESCc1ccc(cc1)-c1cc2cnc(N)nc2nc1NC(=O)NC(C)(C)C