Reaction Details
TargetMAP kinase-interacting serine/threonine-protein kinase 2
LigandBDBM30636
Substrate/Competitorn/a
Meas. Tech.Inhibition Assay
pH7.4±n/a
Temperature303.15±n/a K
IC50 8±n/a nM
Commentsextracted
Citation Heckel, AHimmelsbach, FKley, JLehmann-Lintz, TRedemann, NSauer, AThomas, LWiedenmayer, DBlack, PBlackaby, WLinney, IAusten, MDanilewicz, JSchneider, MSchreiter, K Thienopyrimidines containing a substituted alkyl group for pharmaceutical compositions US Patent US8853193 Publication Date 10/7/2014
 
MAP kinase-interacting serine/threonine-protein kinase 2
Name:MAP kinase-interacting serine/threonine-protein kinase 2
Type:Protein
Mol. Mass.:51870.79
Organism:Homo sapiens (Human)
Description:Q9HBH9
Residue:465
BDBM30636
NameBDBM30636
Synonyms:US8853193, 32-21
Typen/a
Emp. Form.C18H15F3N4O2S
Mol. Mass.408.398
SMILESCc1c(sc2ncnc(Nc3ccc(F)cc3OCC3CC3(F)F)c12)C(N)=O